Rockbox.org home
release
dev builds
extras
themes manual
wiki
device status forums
mailing lists
IRC bugs
patches
dev guide



Rockbox mail archive

Subject: Cygwin error when compiling rockbox

Cygwin error when compiling rockbox

From: Hamish Mackenzie <hamish_at_mackenzieoz.com>
Date: Tue, 11 Dec 2007 05:48:23 +1100

Hi All

As I stated in a previous email I am having trouble creating english.voice files when I change the quality setting from 4 to 10, so I thought I would try to compile rb first and then go ahead and make the voice and I got some errors trying to compile. Here is what I did.

I started up cygwin and entered

svn co svn://svn.rockbox.org/rockbox/trunk rockbox

I then navigated to the rockbox directory and then the myBuild directory and entered ../tools/configure. I then entered m and then typed make and sat back and waited and I got the following series of messages.

Copyright (C) Markus Kohm, 1994-2002
)) (/usr/share/texmf/tex/latex/base/inputenc.sty
! LaTeX Error: File `utf8x.def' not found.
Type X to quit or <RETURN> to proceed,
or enter new name. (Default extension: def)
Enter file name:

If I then type x and hit enter i get a bit more as follows...

/usr/share/texmf/tex/latex/base/inputenc.sty:121: Undefined control sequence.
\GenericError ...
#4 \errhelp \@err@ ...
l.121 \endinputFile `utf8x.def' not found.
^^M
? pe X to quit or <RETURN> to proceed,
or enter new name. (Default extension: def)

if I then do another x there is a bit more in terms of error messages please see below...

~/rockbox/myBuild
(/usr/share/texmf/tex/latex/koma-script/scrreprt.cls
Document Class: scrreprt 2004/09/16 v2.9t LaTeX2e KOMA document class
(/usr/share/texmf/tex/latex/koma-script/scrlfile.sty
Package scrlfile, 2004/09/16 v2.9t LaTeX2e KOMA package
Copyright (C) Markus Kohm
) (/usr/share/texmf/tex/latex/base/size11.clo)
(/usr/share/texmf/tex/latex/koma-script/typearea.sty
Package typearea, 2004/09/16 v2.9t LaTeX2e KOMA package
Copyright (C) Frank Neukam, 1992-1994
xCopyright (C) Markus Kohm, 1994-2002
/usr/share/texmf/tex/latex/base/inputenc.sty:121: Undefined control sequence.
\GenericError ...
#4 \errhelp \@err@ ...
l.121 \endinputFile `utf8x.def' not found.
^^M
? xe X to quit or <RETURN> to proceed,
No pages of output.(Default extension: def)
Transcript written on rockbox-build.log.
make[2]: *** [rockbox-build.aux] Error 1
make[1]: *** [manual-pdf] Error 2
make: *** [build] Error 2
hamish_at_DCDesk ~/rockbox/myBuild
$ ../tools/configure

I am not the most experienced Cygwin user so keep the answers nice and simple :)

Hope this makes sense to someone :)

Cheers

Hamish
Received on 2007-12-10


Page was last modified "Jan 10 2012" The Rockbox Crew
aaa