Rockbox.org home
release
dev builds
extras
themes manual
wiki
device status forums
mailing lists
IRC bugs
patches
dev guide



Rockbox mail archive

Subject: Daily build error

Daily build error

From: <joerch.net_at_web.de>
Date: 2006-04-20

Hi devs,
since some days I got these build errors under cygwin. Can some wise guy find the reason?

bash:
mkdir my
cd my
../tools/configure
make tools
make clean
make
make zip

________________________________________
gcc -I../include -c -o ucl_str.o ucl_str.c
gcc -I../include -c -o ucl_util.o ucl_util.c
sh-elf-ar ruv libucl.a alloc.o io.o n2b_99.o n2b_d.o n2b_ds.o n2b_to.o n2d_99.o n2d_d.o
n2d_ds.o n2d_to.o n2e_99.o n2e_d.o n2e_ds.o n2e_to.o ucl_crc.o ucl_dll.o ucl_init.o ucl_
ptr.o ucl_str.o ucl_util.o >/dev/null 2>&1
sh-elf-ranlib libucl.a
gcc uclpack.o src/libucl.a -o ../uclpack
src/libucl.a: could not read symbols: Archive has no index; run ranlib to add one
collect2: ld returned 1 exit status
make[2]: *** [../uclpack] Error 1
make[1]: *** [uclpack] Error 2
make: *** [tools] Error 2
Cleaning build directory
make[1]: `rdf2binary' is up to date.
make[1]: `convbdf' is up to date.
make[1]: `scramble' is up to date.
make[1]: `descramble' is up to date.
make[1]: `sh2d' is up to date.
make -C ucl
gcc uclpack.o src/libucl.a -o ../uclpack
src/libucl.a: could not read symbols: Archive has no index; run ranlib to add one
collect2: ld returned 1 exit status
make[2]: *** [../uclpack] Error 1
make[1]: *** [uclpack] Error 2
make: *** [tools] Error 2
find: apps: No such file or directory
        zip warning: name not matched: ajbrec.ajz

zip error: Nothing to do! (rockbox.zip)

~>
________________________________________

Joerch
_______________________________________________________________
SMS schreiben mit WEB.DE FreeMail - einfach, schnell und
kostenguenstig. Jetzt gleich testen! http://f.web.de/?mc=021192
Received on Thu Apr 20 13:49:13 2006


Page was last modified "Jan 10 2012" The Rockbox Crew
aaa