Rockbox.org home
release
dev builds
extras
themes manual
wiki
device status forums
mailing lists
IRC bugs
patches
dev guide



Rockbox mail archive

Subject: Error building rbutil

Error building rbutil

From: asettico <asettico_at_rossomaltese.it>
Date: Mon, 18 May 2009 15:21:46 +0200

Hi all,
I'm building the version 20981 from sources, but I'm experiencing this error
for rbutil:

g++ -c -pipe -fpermissive -O2 -D_REENTRANT -Wall -W -DQT_SHARED
-DQT_NO_DEBUG_OUTPUT -DRBUTIL -D_LARGEFILE64_SOURCE -DQT_NO_DEBUG
-DQT_GUI_LIB -DQT_NETWORK_LIB -DQT_CORE_LIB
-I/usr/share/qt4/mkspecs/linux-g++ -I. -I/usr/include/qt4/QtCore
-I/usr/include/qt4/QtCore -I/usr/include/qt4/QtNetwork
-I/usr/include/qt4/QtNetwork -I/usr/include/qt4/QtGui
-I/usr/include/qt4/QtGui -I/usr/include/qt4 -I. -Iirivertools -Izip -Izlib
-I../ipodpatcher -I../sansapatcher -I../../tools/rbspeex -I../../tools
-Ibase -Ibuild/moc -Ibuild/ui -o build/o/encttscfggui.o encttscfggui.cpp
encttscfggui.cpp: In member function ‘void EncTtsCfgGui::setUpWindow()’:
encttscfggui.cpp:54: error: ‘QFormLayout’ was not declared in this scope
encttscfggui.cpp:54: error: ‘formlayout’ was not declared in this scope
encttscfggui.cpp:54: error: expected type-specifier before ‘QFormLayout’
encttscfggui.cpp:54: error: expected `;' before ‘QFormLayout’
make: *** [build/o/encttscfggui.o] Error 1

My platform is Ubuntu 8.10, Qt 4.3.4.
Please, ask me for any other information.
TIA

-- 
  ,= ,-_-. =.  asettico ~ [ http://rossomaltese.it/   ]
((_/)o o(\_)) OpenPGP ~~ [ 1024D/1CB926BA 2003-11-29 ]
  `-'(. .)`-'
      \_/
Received on 2009-05-18

Page was last modified "Jan 10 2012" The Rockbox Crew
aaa