Rockbox.org home
release
dev builds
extras
themes manual
wiki
device status forums
mailing lists
IRC bugs
patches
dev guide



Rockbox mail archive

Subject: Sim build failing?

Sim build failing?

From: pondlife <pondlife_at_pondlife.me>
Date: Sat, 11 Jun 2011 10:04:02 +0100

r29992 has broken my Cygwin sim build.

CC uisimulator/common/io.c
/home/Steve/rockbox/uisimulator/common/io.c: In function `sim_readdir':
/home/Steve/rockbox/uisimulator/common/io.c:350: error: `EOVERFLOW'
undeclared (first use in this function)
/home/Steve/rockbox/uisimulator/common/io.c:350: error: (Each undeclared
identifier is reported only once
/home/Steve/rockbox/uisimulator/common/io.c:350: error: for each function it
appears in.)
make: *** [/home/Steve/rockbox/buildsim/uisimulator/common/io.o] Error 1

Is this just me, or an actual bug?

pondlife
Received on 2011-06-11


Page was last modified "Jan 10 2012" The Rockbox Crew
aaa