Rockbox

  • Status Closed
  • Percent Complete
    100%
  • Task Type Bugs
  • Category Utils
  • Assigned To No-one
  • Operating System All players
  • Severity Low
  • Priority Very Low
  • Reported Version Daily build (which?)
  • Due in Version Undecided
  • Due Date Undecided
  • Votes
  • Private
Attached to Project: Rockbox
Opened by Thomas Schott - 2008-09-08
Last edited by Dominik Wenger - 2008-09-10

FS#9374 - r18424 has broken compiling of wpseditor

Since r18424 (adds support for greyscale targets) I get errors when compiling the wpseditor (linux system):

[…]
CC [IRIVER_H100]
[…]
In Datei, eingefügt von ../../../apps/recorder/peakmeter.c:37:
../../../apps/recorder/icons.h:34:32: Fehler: remote_rockboxlogo.h: No such file or directory
In Datei, eingefügt von ../../../apps/recorder/icons.c:31:
../../../apps/recorder/icons.h:34:32: Fehler: remote_rockboxlogo.h: No such file or directory
In Datei, eingefügt von ../../../apps/status.c:38:
../../../apps/recorder/icons.h:34:32: Fehler: remote_rockboxlogo.h: No such file or directory
[…]

Closed by  Dominik Wenger
2008-09-10 19:15
Reason for closing:  Fixed
Additional comments about closing:  

Ups, that was my fault. I forgot a new empty dummy header file :-). Now fixed in svn.

Dominik Riebeling commented on 2008-09-09 22:25

please set LANG=C before posting error output, this makes it easier for those not speaking your language.

“Datei, eingefügt von”? Was will mir das Ding damit sagen? Einige Lokalisierungen sind schon sehr merkwürdig …

Thomas Schott commented on 2008-09-10 09:02

Sorry, should really use my brain…

[…]
CC [IRIVER_H100]
[…]
In file included from ../../../apps/recorder/peakmeter.c:37:
../../../apps/recorder/icons.h:34:32: error: remote_rockboxlogo.h: No such file or directory
In file included from ../../../apps/recorder/icons.c:31:
../../../apps/recorder/icons.h:34:32: error: remote_rockboxlogo.h: No such file or directory
In file included from ../../../apps/status.c:38:
../../../apps/recorder/icons.h:34:32: error: remote_rockboxlogo.h: No such file or directory
[…]
make[1]: * [libwps_IRIVER_H100.so] Error 1
make[1]: Leaving directory `/home/scotty/Rockbox/BUILD/rockbox-r18475.work/utils/wpseditor/libwps’ make:
* [sub-libwps-make_default] Error 2

Loading...

Available keyboard shortcuts

Tasklist

Task Details

Task Editing